Reaction Details
TargetAcyl-CoA desaturase 1
LigandBDBM50060671
Substrate/Competitorn/a
Meas. Tech.ChEMBL_1462109 (CHEMBL3396816)
IC50 15±n/a nM
Citation Sun, SZhang, ZPokrovskaia, NChowdhury, SJia, QChang, EKhakh, KKwan, RMcLaren, DGRadomski, CCRatkay, LGFu, JDales, NAWinther, MD Discovery of triazolone derivatives as novel, potent stearoyl-CoA desaturase-1 (SCD1) inhibitors. Bioorg Med Chem23:455-65 (2015) 
 
Acyl-CoA desaturase 1
Name:Acyl-CoA desaturase 1
Type:PROTEIN
Mol. Mass.:41064.54
Organism:Mus musculus
Description:ChEMBL_1462109
Residue:355
BDBM50060671
NameBDBM50060671
Synonyms:CHEMBL3394691
TypeSmall organic molecule
Emp. Form.C21H19FN6O3S
Mol. Mass.454.477
SMILESCc1nc(sc1C(=O)NCc1cccnc1)-n1cnn(CCOc2ccc(F)cc2)c1=O