Reaction Details
TargetAcyl-CoA desaturase 1
LigandBDBM50060650
Substrate/Competitorn/a
Meas. Tech.ChEMBL_1462109 (CHEMBL3396816)
IC50 19±n/a nM
Citation Sun, SZhang, ZPokrovskaia, NChowdhury, SJia, QChang, EKhakh, KKwan, RMcLaren, DGRadomski, CCRatkay, LGFu, JDales, NAWinther, MD Discovery of triazolone derivatives as novel, potent stearoyl-CoA desaturase-1 (SCD1) inhibitors. Bioorg Med Chem23:455-65 (2015) 
 
Acyl-CoA desaturase 1
Name:Acyl-CoA desaturase 1
Type:PROTEIN
Mol. Mass.:41064.54
Organism:Mus musculus
Description:ChEMBL_1462109
Residue:355
BDBM50060650
NameBDBM50060650
Synonyms:CHEMBL3394685
TypeSmall organic molecule
Emp. Form.C19H18FN7O2S
Mol. Mass.427.455
SMILESCc1nc(sc1C(=O)NCc1cnn(C)c1)-n1cnn(Cc2ccc(F)cc2)c1=O