Reaction Details
TargetMu-type opioid receptor
LigandBDBM50060897
Substrate/Competitorn/a
Meas. Tech.ChEMBL_1462195 (CHEMBL3395052)
IC50 540±n/a nM
Citation Ross, TMBattista, KBignan, GCBrenneman, DEConnolly, PJLiu, JMiddleton, SAOrsini, MReitz, ABRosenthal, DIScott, MKVaidya, AH A selective small molecule NOP (ORL-1 receptor) partial agonist for the treatment of anxiety. Bioorg Med Chem Lett25:602-6 (2015) 
 
Mu-type opioid receptor
Name:Mu-type opioid receptor
Type:G Protein-Coupled Receptor (GPCR)
Mol. Mass.:44789.51
Organism:Homo sapiens (Human)
Description:P35372
Residue:400
BDBM50060897
NameBDBM50060897
Synonyms:CHEMBL3394754
TypeSmall organic molecule
Emp. Form.C32H44FN3O2S
Mol. Mass.553.774
SMILESCc1cccc(SC[C@H](O)CN2CN(c3ccc(F)cc3)C3(CCN(CC4CCCCCCC4)CC3)C2=O)c1