Reaction Details
TargetKappa-type opioid receptor
LigandBDBM50060893
Substrate/Competitorn/a
Meas. Tech.ChEMBL_1462197 (CHEMBL3395054)
IC50 200±n/a nM
Citation Ross, TMBattista, KBignan, GCBrenneman, DEConnolly, PJLiu, JMiddleton, SAOrsini, MReitz, ABRosenthal, DIScott, MKVaidya, AH A selective small molecule NOP (ORL-1 receptor) partial agonist for the treatment of anxiety. Bioorg Med Chem Lett25:602-6 (2015) 
 
Kappa-type opioid receptor
Name:Kappa-type opioid receptor
Type:G Protein-Coupled Receptor (GPCR)
Mol. Mass.:42648.76
Organism:Homo sapiens (Human)
Description:P41145
Residue:380
BDBM50060893
NameBDBM50060893
Synonyms:CHEMBL3394753
TypeSmall organic molecule
Emp. Form.C35H51FN4O4
Mol. Mass.610.8022
SMILESCOc1ccc(CCNC[C@H](O)CN2CN(c3ccc(F)cc3)C3(CCN(CC4CCCCCCC4)CC3)C2=O)cc1OC