Reaction Details
TargetOrexin receptor type 2
LigandBDBM50060938
Substrate/Competitorn/a
Meas. Tech.ChEMBL_1462305 (CHEMBL3395398)
Ki 0.240000±n/a nM
Citation Raheem, ITBreslin, MJBruno, JCabalu, TDCooke, ACox, CDCui, DGarson, SGotter, ALFox, SVHarrell, CMKuduk, SDLemaire, WPrueksaritanont, TRenger, JJStump, CTannenbaum, PLWilliams, PDWinrow, CJColeman, PJ Discovery of piperidine ethers as selective orexin receptor antagonists (SORAs) inspired by filorexant. Bioorg Med Chem Lett25:444-50 (2015) 
 
Orexin receptor type 2
Name:Orexin receptor type 2
Type:Protein
Mol. Mass.:50710.53
Organism:Homo sapiens (Human)
Description:O43614
Residue:444
BDBM50060938
NameBDBM50060938
Synonyms:CHEMBL3394847
TypeSmall organic molecule
Emp. Form.C25H25N5O3
Mol. Mass.443.4977
SMILESCOc1cnc(O[C@@H]2CC[C@@H](C)N(C2)C(=O)c2ccccc2-n2nccn2)c2ccccc12