Reaction Details
TargetHistamine H4 receptor
LigandBDBM50061020
Substrate/Competitorn/a
Meas. Tech.ChEMBL_1461283 (CHEMBL3396057)
Ki 2.0±n/a nM
Citation Savall, BMMeduna, SPTays, KCai, HThurmond, RLMcGovern, PGaul, MZhao, BPEdwards, JP Diaminopyrimidines, diaminopyridines and diaminopyridazines as histamine H4 receptor modulators. Bioorg Med Chem Lett25:956-9 (2015) 
 
Histamine H4 receptor
Name:Histamine H4 receptor
Type:G Protein-Coupled Receptor (GPCR)
Mol. Mass.:44517.02
Organism:Homo sapiens (Human)
Description:Binding assays were using CHO cells stably expressing hH4R receptors.
Residue:390
BDBM50061020
NameBDBM50061020
Synonyms:CHEMBL3393544
TypeSmall organic molecule
Emp. Form.C14H23N5
Mol. Mass.261.3659
SMILESCN[C@@H]1CCN(C1)c1ccnc(NC2CCCC2)n1