Reaction Details
TargetHistamine H4 receptor
LigandBDBM50061098
Substrate/Competitorn/a
Meas. Tech.ChEMBL_1461284 (CHEMBL3396058)
EC50>10000±n/a nM
Citation Savall, BMMeduna, SPTays, KCai, HThurmond, RLMcGovern, PGaul, MZhao, BPEdwards, JP Diaminopyrimidines, diaminopyridines and diaminopyridazines as histamine H4 receptor modulators. Bioorg Med Chem Lett25:956-9 (2015) 
 
Histamine H4 receptor
Name:Histamine H4 receptor
Type:G Protein-Coupled Receptor (GPCR)
Mol. Mass.:44517.02
Organism:Homo sapiens (Human)
Description:Binding assays were using CHO cells stably expressing hH4R receptors.
Residue:390
BDBM50061098
NameBDBM50061098
Synonyms:CHEMBL3393534 | US9732087, 1
TypeSmall organic molecule
Emp. Form.C17H26N4
Mol. Mass.286.4151
SMILESCN[C@@H]1CCN(C1)c1ccnc(NC2CC3CCC2C3)c1