Reaction Details
TargetHistamine H4 receptor
LigandBDBM50061060
Substrate/Competitorn/a
Meas. Tech.ChEMBL_1461284 (CHEMBL3396058)
EC50 15±n/a nM
Citation Savall, BMMeduna, SPTays, KCai, HThurmond, RLMcGovern, PGaul, MZhao, BPEdwards, JP Diaminopyrimidines, diaminopyridines and diaminopyridazines as histamine H4 receptor modulators. Bioorg Med Chem Lett25:956-9 (2015) 
 
Histamine H4 receptor
Name:Histamine H4 receptor
Type:G Protein-Coupled Receptor (GPCR)
Mol. Mass.:44517.02
Organism:Homo sapiens (Human)
Description:Binding assays were using CHO cells stably expressing hH4R receptors.
Residue:390
BDBM50061060
NameBDBM50061060
Synonyms:CHEMBL3393539 | US9732087, 32
TypeSmall organic molecule
Emp. Form.C13H23N5
Mol. Mass.249.3552
SMILESCN[C@@H]1CCN(C1)c1ccnc(NCC(C)C)n1