Reaction Details
TargetTransient receptor potential cation channel subfamily V member 1
LigandBDBM50061355
Substrate/Competitorn/a
Meas. Tech.ChEMBL_1461538 (CHEMBL3396779)
Ki 8.9±n/a nM
Citation Sun, WKim, HSLee, SJung, AKim, SEAnn, JYoon, SChoi, SLee, JHBlumberg, PMFrank-Foltyn, RBahrenberg, GSchiene, KStockhausen, HChristoph, TFrormann, SLee, J 6,6-Fused heterocyclic ureas as highly potent TRPV1 antagonists. Bioorg Med Chem Lett25:803-6 (2015) 
 
Transient receptor potential cation channel subfamily V member 1
Name:Transient receptor potential cation channel subfamily V member 1
Type:Protein
Mol. Mass.:94960.75
Organism:Homo sapiens (Human)
Description:Q8NER1
Residue:839
BDBM50061355
NameBDBM50061355
Synonyms:CHEMBL3393832
TypeSmall organic molecule
Emp. Form.C22H23F3N6O
Mol. Mass.444.4528
SMILESCC1CCN(CC1)c1nc(ccc1CNC(=O)Nc1ccc2cnncc2c1)C(F)(F)F