Reaction Details
TargetTransient receptor potential cation channel subfamily V member 1
LigandBDBM20334
Substrate/Competitorn/a
Meas. Tech.ChEMBL_1461538 (CHEMBL3396779)
Ki 18±n/a nM
Citation Sun, WKim, HSLee, SJung, AKim, SEAnn, JYoon, SChoi, SLee, JHBlumberg, PMFrank-Foltyn, RBahrenberg, GSchiene, KStockhausen, HChristoph, TFrormann, SLee, J 6,6-Fused heterocyclic ureas as highly potent TRPV1 antagonists. Bioorg Med Chem Lett25:803-6 (2015) 
 
Transient receptor potential cation channel subfamily V member 1
Name:Transient receptor potential cation channel subfamily V member 1
Type:Protein
Mol. Mass.:94960.75
Organism:Homo sapiens (Human)
Description:Q8NER1
Residue:839
BDBM20334
NameBDBM20334
Synonyms:1-Isoquinolin-5-yl-3-(4-trifluoromethyl-benzyl)-urea A-425619 JMC48744 Compound 14a
TypeSmall organic molecule
Emp. Form.C18H14F3N3O
Mol. Mass.345.3185
SMILESFC(F)(F)c1ccc(CNC(=O)Nc2cccc3cnccc23)cc1