Reaction Details
TargetMu-type opioid receptor
LigandBDBM50061379
Substrate/Competitorn/a
Meas. Tech.ChEMBL_1461563 (CHEMBL3396804)
EC50 39000±n/a nM
Citation Sasmal, PKKrishna, CVAdabala, SSRoshaiah, MRawoof, KAThadi, ESukumar, KPCheera, SAbbineni, CRao, KVPrasanthi, ANijhawan, KJaleel, MIyer, LRChaitanya, TKTiwari, NKKrishna, NLPotluri, VKhanna, IFrimurer, TMLückmann, MRist, ØElster, LHögberg, T Optimisation of in silico derived 2-aminobenzimidazole hits as unprecedented selective kappa opioid receptor agonists. Bioorg Med Chem Lett25:887-92 (2015) 
 
Mu-type opioid receptor
Name:Mu-type opioid receptor
Type:G Protein-Coupled Receptor (GPCR)
Mol. Mass.:44789.51
Organism:Homo sapiens (Human)
Description:P35372
Residue:400
BDBM50061379
NameBDBM50061379
Synonyms:CHEMBL1488893
TypeSmall organic molecule
Emp. Form.C21H24N4O
Mol. Mass.348.4415
SMILESCc1ccc(cc1)C(=O)Nc1nc2ccccc2n1CCN1CCCC1