Reaction Details
TargetDelta-type opioid receptor
LigandBDBM50061382
Substrate/Competitorn/a
Meas. Tech.ChEMBL_1461562 (CHEMBL3396803)
EC50 1850±n/a nM
Citation Sasmal, PKKrishna, CVAdabala, SSRoshaiah, MRawoof, KAThadi, ESukumar, KPCheera, SAbbineni, CRao, KVPrasanthi, ANijhawan, KJaleel, MIyer, LRChaitanya, TKTiwari, NKKrishna, NLPotluri, VKhanna, IFrimurer, TMLückmann, MRist, ØElster, LHögberg, T Optimisation of in silico derived 2-aminobenzimidazole hits as unprecedented selective kappa opioid receptor agonists. Bioorg Med Chem Lett25:887-92 (2015) 
 
Delta-type opioid receptor
Name:Delta-type opioid receptor
Type:G Protein-Coupled Receptor (GPCR)
Mol. Mass.:40382.98
Organism:Homo sapiens (Human)
Description:Competition binding assays were carried out using membrane preparations from transfected HN9.10 cells that constitutively expressed the delta opioid receptor.
Residue:372
BDBM50061382
NameBDBM50061382
Synonyms:CHEMBL3394006
TypeSmall organic molecule
Emp. Form.C20H21ClN4O2
Mol. Mass.384.859
SMILESO[C@H]1CCN(CCn2c(NC(=O)c3ccc(Cl)cc3)nc3ccccc23)C1