Reaction Details
TargetDelta-type opioid receptor
LigandBDBM50061380
Substrate/Competitorn/a
Meas. Tech.ChEMBL_1461562 (CHEMBL3396803)
EC50 1150±n/a nM
Citation Sasmal, PKKrishna, CVAdabala, SSRoshaiah, MRawoof, KAThadi, ESukumar, KPCheera, SAbbineni, CRao, KVPrasanthi, ANijhawan, KJaleel, MIyer, LRChaitanya, TKTiwari, NKKrishna, NLPotluri, VKhanna, IFrimurer, TMLückmann, MRist, ØElster, LHögberg, T Optimisation of in silico derived 2-aminobenzimidazole hits as unprecedented selective kappa opioid receptor agonists. Bioorg Med Chem Lett25:887-92 (2015) 
 
Delta-type opioid receptor
Name:Delta-type opioid receptor
Type:G Protein-Coupled Receptor (GPCR)
Mol. Mass.:40382.98
Organism:Homo sapiens (Human)
Description:Competition binding assays were carried out using membrane preparations from transfected HN9.10 cells that constitutively expressed the delta opioid receptor.
Residue:372
BDBM50061380
NameBDBM50061380
Synonyms:CHEMBL3394008
TypeSmall organic molecule
Emp. Form.C18H22N6O3S
Mol. Mass.402.471
SMILESCS(=O)(=O)c1c[nH]c(c1)C(=O)Nc1nc2cccnc2n1CCN1CCCC1