Reaction Details
TargetPotassium voltage-gated channel subfamily H member 2
LigandBDBM50061590
Substrate/Competitorn/a
Meas. Tech.ChEMBL_1461648 (CHEMBL3395117)
Ki>10000±n/a nM
Citation Chen, JJLiu, QYuan, CGore, VLopez, PMa, VAmegadzie, AQian, WJudd, TCMinatti, AEBrown, JCheng, YXue, MZhong, WDineen, TAEpstein, OHuman, JKreiman, CMarx, IWeiss, MMHitchcock, SAPowers, TSChen, KWen, PHWhittington, DACheng, ACBartberger, MDHickman, DWerner, JAVargas, HMEverds, NEVonderfecht, SLDunn, RTWood, SFremeau, RTWhite, RDPatel, VF Development of 2-aminooxazoline 3-azaxanthenes as orally efficaciousß-secretase inhibitors for the potential treatment of Alzheimer's disease. Bioorg Med Chem Lett25:767-74 (2015) 
 
Potassium voltage-gated channel subfamily H member 2
Name:Potassium voltage-gated channel subfamily H member 2
Type:Multi-pass membrane protein
Mol. Mass.:126672.65
Organism:Homo sapiens (Human)
Description:Q12809
Residue:1159
BDBM50061590
NameBDBM50061590
Synonyms:CHEMBL3394054
TypeSmall organic molecule
Emp. Form.C24H16FN5O2
Mol. Mass.425.4145
SMILESNC1=N[C@@]2(CO1)c1cc(ccc1Oc1cnc(cc21)-c1cccnc1)-c1cccnc1F