Reaction Details
TargetGrowth hormone secretagogue receptor type 1
LigandBDBM50061716
Substrate/Competitorn/a
Meas. Tech.ChEMBL_1461883 (CHEMBL3396113)
Ki 263±n/a nM
Citation Orr, STBeveridge, RBhattacharya, SKCameron, KOCoffey, SFernando, DHepworth, DJackson, MVKhot, VKosa, RLapham, KLoria, PMMcClure, KFPatel, JRose, CSaenz, JStock, IAStorer, Gvon Volkenburg, MVrieze, DWang, GXiao, JZhang, Y Evaluation and synthesis of polar aryl- and heteroaryl spiroazetidine-piperidine acetamides as ghrelin inverse agonists. ACS Med Chem Lett6:156-61 (2015) 
 
Growth hormone secretagogue receptor type 1
Name:Growth hormone secretagogue receptor type 1
Type:Receptor
Mol. Mass.:41334.57
Organism:Homo sapiens (Human)
Description:Receptor binding studies use plasma membranes from LLC PK-1 cells transiently transfected with hGHSR1a.
Residue:366
BDBM50061716
NameBDBM50061716
Synonyms:CHEMBL3394202
TypeSmall organic molecule
Emp. Form.C30H34N6O3
Mol. Mass.526.6294
SMILESCOc1cc(C(N)=O)c(CC(=O)N2CCC3(CN(C3)[C@@H]3CCc4cc(ccc34)-c3nccc(C)n3)CC2)cn1