Reaction Details
TargetPotassium voltage-gated channel subfamily H member 2
LigandBDBM50061835
Substrate/Competitorn/a
Meas. Tech.ChEMBL_1462014 (CHEMBL3396464)
Ki>15000±n/a nM
Citation Cheng, YBrown, JJudd, TCLopez, PQian, WPowers, TSChen, JJBartberger, MDChen, KDunn, RTEpstein, OFremeau, RTHarried, SHickman, DHitchcock, SALuo, YMinatti, AEPatel, VFVargas, HMWahl, RCWeiss, MMWen, PHWhite, RDWhittington, DAZheng, XMWood, S An Orally Available BACE1 Inhibitor That Affords Robust CNS Aß Reduction without Cardiovascular Liabilities. ACS Med Chem Lett6:210-5 (2015) 
 
Potassium voltage-gated channel subfamily H member 2
Name:Potassium voltage-gated channel subfamily H member 2
Type:Multi-pass membrane protein
Mol. Mass.:126672.65
Organism:Homo sapiens (Human)
Description:Q12809
Residue:1159
BDBM50061835
NameBDBM50061835
Synonyms:CHEMBL3394228
TypeSmall organic molecule
Emp. Form.C23H15F2N5O3
Mol. Mass.447.3937
SMILESCc1cc(on1)-c1cc2c(Oc3ccc(cc3[C@@]22COC(N)=N2)-c2cccnc2F)c(F)n1