Reaction Details
TargetBeta-secretase 1
LigandBDBM50061775
Substrate/Competitorn/a
Meas. Tech.ChEMBL_1462007 (CHEMBL3396457)
IC50 0.300000±n/a nM
Citation Cheng, YBrown, JJudd, TCLopez, PQian, WPowers, TSChen, JJBartberger, MDChen, KDunn, RTEpstein, OFremeau, RTHarried, SHickman, DHitchcock, SALuo, YMinatti, AEPatel, VFVargas, HMWahl, RCWeiss, MMWen, PHWhite, RDWhittington, DAZheng, XMWood, S An Orally Available BACE1 Inhibitor That Affords Robust CNS Aß Reduction without Cardiovascular Liabilities. ACS Med Chem Lett6:210-5 (2015) 
 
Beta-secretase 1
Name:Beta-secretase 1
Type:Protein
Mol. Mass.:55755.10
Organism:Homo sapiens (Human)
Description:P56817
Residue:501
BDBM50061775
NameBDBM50061775
Synonyms:CHEMBL3394225
TypeSmall organic molecule
Emp. Form.C24H19F4N5O2
Mol. Mass.485.4336
SMILESNC1=N[C@@]2(CO1)c1cc(ccc1Oc1c(F)nc(cc21)N1CCC(F)(F)CC1)-c1cccnc1F