Reaction Details
Target3-oxoacyl-ACP synthase
LigandBDBM50062149
Substrate/Competitorn/a
Meas. Tech.ChEMBL_1462635 (CHEMBL3399322)
IC50 14000±n/a nM
Citation Allegretta, GWeidel, EEmpting, MHartmann, RW Catechol-based substrates of chalcone synthase as a scaffold for novel inhibitors of PqsD. Eur J Med Chem90:351-9 (2015) 
 
3-oxoacyl-ACP synthase
Name:3-oxoacyl-ACP synthase
Type:PROTEIN
Mol. Mass.:36357.84
Organism:Pseudomonas aeruginosa
Description:ChEMBL_109728
Residue:337
BDBM50062149
NameBDBM50062149
Synonyms:CHEMBL3093471
TypeSmall organic molecule
Emp. Form.C11H14O4
Mol. Mass.210.2265
SMILESCCOC(=O)CCc1ccc(O)c(O)c1