Reaction Details
Target3-oxoacyl-ACP synthase
LigandBDBM50062150
Substrate/Competitorn/a
Meas. Tech.ChEMBL_1462635 (CHEMBL3399322)
IC50 23000±n/a nM
Citation Allegretta, GWeidel, EEmpting, MHartmann, RW Catechol-based substrates of chalcone synthase as a scaffold for novel inhibitors of PqsD. Eur J Med Chem90:351-9 (2015) 
 
3-oxoacyl-ACP synthase
Name:3-oxoacyl-ACP synthase
Type:PROTEIN
Mol. Mass.:36357.84
Organism:Pseudomonas aeruginosa
Description:ChEMBL_109728
Residue:337
BDBM50062150
NameBDBM50062150
Synonyms:CHEMBL3093470
TypeSmall organic molecule
Emp. Form.C10H12O4
Mol. Mass.196.1999
SMILESCOC(=O)CCc1ccc(O)c(O)c1