Reaction Details
TargetProto-oncogene tyrosine-protein kinase ROS
LigandBDBM50062380
Substrate/Competitorn/a
Meas. Tech.ChEMBL_1462712 (CHEMBL3399440)
IC50 56±n/a nM
Citation Abdelazem, AZAl-Sanea, MMPark, BSPark, HMYoo, KHSim, TPark, JBLee, SHLee, SH Synthesis and biological evaluation of new pyrazol-4-ylpyrimidine derivatives as potential ROS1 kinase inhibitors. Eur J Med Chem90:195-208 (2015) 
 
Proto-oncogene tyrosine-protein kinase ROS
Name:Proto-oncogene tyrosine-protein kinase ROS
Type:Enzyme
Mol. Mass.:263897.39
Organism:Homo sapiens (Human)
Description:P08922
Residue:2347
BDBM50062380
NameBDBM50062380
Synonyms:CHEMBL3397286
TypeSmall organic molecule
Emp. Form.C26H27N7O2
Mol. Mass.469.5383
SMILESCOc1cc(C)cc(c1)-c1nn(CC#N)cc1-c1cc(NCCCCO)nc(n1)-c1cccnc1