Reaction Details
TargetCannabinoid receptor 1
LigandBDBM50062494
Substrate/Competitorn/a
Meas. Tech.ChEMBL_1462819 (CHEMBL3399658)
Ki>10000±n/a nM
Citation Bertini, SParkkari, TSavinainen, JRArena, CSaccomanni, GSaguto, SLigresti, AAllarà, MBruno, AMarinelli, LDi Marzo, VNovellino, EManera, CMacchia, M Synthesis, biological activity and molecular modeling of new biphenylic carboxamides as potent and selective CB2 receptor ligands. Eur J Med Chem90:526-36 (2015) 
 
Cannabinoid receptor 1
Name:Cannabinoid receptor 1
Type:G Protein-Coupled Receptor (GPCR)
Mol. Mass.:52868.96
Organism:Homo sapiens (Human)
Description:P21554
Residue:472
BDBM50062494
NameBDBM50062494
Synonyms:CHEMBL3397445
TypeSmall organic molecule
Emp. Form.C23H29NO3
Mol. Mass.367.4813
SMILESCOc1ccc(cc1)-c1cc(C)c(OC)c(c1)C(=O)NC1CCCCCC1