Reaction Details
TargetCannabinoid receptor 2
LigandBDBM50062505
Substrate/Competitorn/a
Meas. Tech.ChEMBL_1462820 (CHEMBL3399659)
Ki 60±n/a nM
Citation Bertini, SParkkari, TSavinainen, JRArena, CSaccomanni, GSaguto, SLigresti, AAllarà, MBruno, AMarinelli, LDi Marzo, VNovellino, EManera, CMacchia, M Synthesis, biological activity and molecular modeling of new biphenylic carboxamides as potent and selective CB2 receptor ligands. Eur J Med Chem90:526-36 (2015) 
 
Cannabinoid receptor 2
Name:Cannabinoid receptor 2
Type:G Protein-Coupled Receptor (GPCR)
Mol. Mass.:39690.94
Organism:Homo sapiens (Human)
Description:P34972
Residue:360
BDBM50062505
NameBDBM50062505
Synonyms:CHEMBL3397519
TypeSmall organic molecule
Emp. Form.C22H26FNO2
Mol. Mass.355.4457
SMILESCOc1c(C)cc(cc1C(=O)N[C@@H]1CC[C@H](C)CC1)-c1ccc(F)cc1