Reaction Details
TargetDelta-type opioid receptor
LigandBDBM50062536
Substrate/Competitorn/a
Meas. Tech.ChEMBL_1462886 (CHEMBL3399798)
Ki 73±n/a nM
Citation Schmitt, SColloc'h, NPerrio, C Novel fluoroalkyl derivatives of selective kappa opioid receptor antagonist JDTic: Design, synthesis, pharmacology and molecular modeling studies. Eur J Med Chem90:742-50 (2015) 
 
Delta-type opioid receptor
Name:Delta-type opioid receptor
Type:G Protein-Coupled Receptor (GPCR)
Mol. Mass.:40382.98
Organism:Homo sapiens (Human)
Description:Competition binding assays were carried out using membrane preparations from transfected HN9.10 cells that constitutively expressed the delta opioid receptor.
Residue:372
BDBM50062536
NameBDBM50062536
Synonyms:CHEMBL3397596
TypeSmall organic molecule
Emp. Form.C31H44FN3O3
Mol. Mass.525.6978
SMILESCC(C)[C@@H](CN1CC[C@](C)([C@@H](C)C1)c1cccc(O)c1)NC(=O)[C@H]1Cc2ccc(OCCCF)cc2CN1