Reaction Details
TargetCytochrome P450 11B1, mitochondrial
LigandBDBM50062549
Substrate/Competitorn/a
Meas. Tech.ChEMBL_1462891 (CHEMBL3399803)
IC50 4.5±n/a nM
Citation Grombein, CMHu, QRau, SZimmer, CHartmann, RW Heteroatom insertion into 3,4-dihydro-1H-quinolin-2-ones leads to potent and selective inhibitors of human and rat aldosterone synthase. Eur J Med Chem90:788-96 (2015) 
 
Cytochrome P450 11B1, mitochondrial
Name:Cytochrome P450 11B1, mitochondrial
Type:Enzyme
Mol. Mass.:57591.44
Organism:Homo sapiens (Human)
Description:P15538
Residue:503
BDBM50062549
NameBDBM50062549
Synonyms:CHEMBL3397607
TypeSmall organic molecule
Emp. Form.C17H13N3O
Mol. Mass.275.3046
SMILESO=C1NCc2cc(ccc2N1)-c1cncc2ccccc12