Reaction Details
TargetGamma-secretase subunit APH-1A/Gamma-secretase subunit APH-1B/Gamma-secretase subunit PEN-2/Nicastrin/Presenilin-1/Presenilin-2
LigandBDBM50172473
Substrate/Competitorn/a
Meas. Tech.ChEMBL_1462983 (CHEMBL3398727)
IC50 307000±n/a nM
Citation Flesch, DNess, JLamers, CDehm, FPopella, SSteri, ROgorek, IHieke, MDannhardt, GWerz, OWeggen, SSchubert-Zsilavecz, M SAR-studies of¿-secretase modulators with PPAR¿-agonistic and 5-lipoxygenase-inhibitory activity for Alzheimer's disease. Bioorg Med Chem Lett25:841-6 (2015) 
 
Gamma-secretase subunit APH-1A/Gamma-secretase subunit APH-1B/Gamma-secretase subunit PEN-2/Nicastrin/Presenilin-1/Presenilin-2
Name:Gamma-secretase subunit APH-1A/Gamma-secretase subunit APH-1B/Gamma-secretase subunit PEN-2/Nicastrin/Presenilin-1/Presenilin-2
Type:n/a
Mol. Mass.:n/a
Description:ASSAY_ID of EBI is 68900
Components:This complex has 6 components.
Component 1
Name:Gamma-secretase subunit APH-1B
Synonyms:APH-1b APH1B_HUMAN Gamma-secretase PSFL | Presenilin-stabilization factor-like
Type:PROTEIN
Mol. Mass.:28468.17
Organism:Homo sapiens (Human)
Description:EBI_10231
Residue:257
Component 2
Name:Presenilin-2
Synonyms:AD3LP AD5 Gamma-secretase PS2 PSN2_HUMAN Presenilin 2 Presenilin-2 CTF subunit STM-2 | STM2
Type:PROTEIN
Mol. Mass.:50116.65
Organism:Homo sapiens (Human)
Description:ChEMBL_855576
Residue:448
Component 3
Name:Gamma-secretase subunit APH-1A
Synonyms:APH-1a APH1A_HUMAN Gamma-Secretase Subunit APH-1A Presenilin-stabilization factor
Type:Enzyme subunit; multi-pass membrane protein
Mol. Mass.:28998.73
Organism:Homo sapiens (Human)
Description:n/a
Residue:265
Component 4
Name:Nicastrin
Synonyms:Gamma-secretase NCSTN Nicastrin
Type:PROTEIN
Mol. Mass.:78404.96
Organism:Homo sapiens (Human)
Description:EBI_10683
Residue:709
Component 5
Name:Presenilin-1
Synonyms:3.4.23.- Gamma-Secretase Subunit Presenilin-1 PS1 PSEN1 PSNL1 Presenilin-1 CTF12 Protein S182
Type:n/a
Mol. Mass.:52657.13
Organism:Homo sapiens (Human)
Description:P49768
Residue:467
Component 6
Name:Gamma-secretase subunit PEN-2
Synonyms:Gamma-Secretase Subunit PEN-2 PEN2 PSENEN | Presenilin enhancer protein 2
Type:Enzyme subunit; multi-pass membrane protein
Mol. Mass.:12031.98
Organism:Homo sapiens (Human)
Description:n/a
Residue:101
BDBM50172473
NameBDBM50172473
Synonyms:(-)-(2R)-2-(2-fluorobiphenyl-4-yl)propanoic acid (2R)-2-(2-fluorobiphenyl-4-yl)propanoic acid (R)-FLURBIPROFEN Flurizan | Tarenflurbil
TypeSmall organic molecule
Emp. Form.C15H13FO2
Mol. Mass.244.2609
SMILESC[C@@H](C(O)=O)c1ccc(c(F)c1)-c1ccccc1