Reaction Details
TargetTyrosine-protein kinase BTK
LigandBDBM50062942
Substrate/Competitorn/a
Meas. Tech.ChEMBL_1463284 (CHEMBL3399473)
IC50 0.500000±n/a nM
Citation Durham, TBBlanco, MJ Target engagement in lead generation. Bioorg Med Chem Lett25:998-1008 (2015) 
 
Tyrosine-protein kinase BTK
Name:Tyrosine-protein kinase BTK
Type:Enzyme
Mol. Mass.:76289.95
Organism:Homo sapiens (Human)
Description:Q06187
Residue:659
BDBM50062942
NameBDBM50062942
Synonyms:CHEMBL3397911
TypeSmall organic molecule
Emp. Form.C50H72N10O9S
Mol. Mass.989.233
SMILES[H][C@@]12CS[C@H](CCCCC(=O)NCCCOCCOCCOCCCNC(=O)CCCC(=O)N(C)CCCOc3cccc(Nc4ncc(C)c(n4)N(C)c4cccc(NC(=O)C=C)c4)c3)[C@]1([H])NC(=O)N2