Reaction Details
TargetReverse transcriptase
LigandBDBM50063014
Substrate/Competitorn/a
Meas. Tech.ChEMBL_1463313 (CHEMBL3399540)
Ki>100000±n/a nM
Citation Babkov, DAValuev-Elliston, VTParamonova, MPOzerov, AAIvanov, AVChizhov, AOKhandazhinskaya, ALKochetkov, SNBalzarini, JDaelemans, DPannecouque, CSeley-Radtke, KLNovikov, MS Scaffold hopping: exploration of acetanilide-containing uracil analogues as potential NNRTIs. Bioorg Med Chem23:1069-81 (2015) 
 
Reverse transcriptase
Name:Reverse transcriptase
Synonyms:n/a
Type:Protein
Mol. Mass.:29598.37
Organism:Human immunodeficiency virus 1
Description:Q9WKE8
Residue:254
BDBM50063014
NameBDBM50063014
Synonyms:CHEMBL3398084
TypeSmall organic molecule
Emp. Form.C20H18ClN3O4
Mol. Mass.399.828
SMILESCn1c(=O)ccn(Cc2ccccc2OCC(=O)Nc2ccccc2Cl)c1=O