Reaction Details
TargetReverse transcriptase
LigandBDBM50063002
Substrate/Competitorn/a
Meas. Tech.ChEMBL_1463322 (CHEMBL3399549)
Ki 63300±n/a nM
Citation Babkov, DAValuev-Elliston, VTParamonova, MPOzerov, AAIvanov, AVChizhov, AOKhandazhinskaya, ALKochetkov, SNBalzarini, JDaelemans, DPannecouque, CSeley-Radtke, KLNovikov, MS Scaffold hopping: exploration of acetanilide-containing uracil analogues as potential NNRTIs. Bioorg Med Chem23:1069-81 (2015) 
 
Reverse transcriptase
Name:Reverse transcriptase
Synonyms:n/a
Type:Protein
Mol. Mass.:29598.37
Organism:Human immunodeficiency virus 1
Description:Q9WKE8
Residue:254
BDBM50063002
NameBDBM50063002
Synonyms:CHEMBL3398101
TypeSmall organic molecule
Emp. Form.C19H14Cl3N3O3
Mol. Mass.438.692
SMILESClc1cc(Cl)cc(Cn2c(=O)ccn(CC(=O)Nc3ccccc3Cl)c2=O)c1