Reaction Details
TargetMyeloblastin
LigandBDBM50063046
Substrate/Competitorn/a
Meas. Tech.ChEMBL_1463425 (CHEMBL3399762)
IC50 2500±n/a nM
Citation Hwang, TLWang, WHWang, TYYu, HPHsieh, PW Synthesis and pharmacological characterization of 2-aminobenzaldehyde oxime analogs as dual inhibitors of neutrophil elastase and proteinase 3. Bioorg Med Chem23:1123-34 (2015) 
 
Myeloblastin
Name:Myeloblastin
Type:PROTEIN
Mol. Mass.:27816.30
Organism:Homo sapiens (Human)
Description:ChEMBL_1463425
Residue:256
BDBM50063046
NameBDBM50063046
Synonyms:CHEMBL3398149
TypeSmall organic molecule
Emp. Form.C20H24N2O5S
Mol. Mass.404.48
SMILESCC\C(=N\O)c1ccccc1NS(=O)(=O)c1ccc(OC(=O)C(C)(C)C)cc1