Reaction Details
TargetMyeloblastin
LigandBDBM50084637
Substrate/Competitorn/a
Meas. Tech.ChEMBL_1463425 (CHEMBL3399762)
IC50 340±n/a nM
Citation Hwang, TLWang, WHWang, TYYu, HPHsieh, PW Synthesis and pharmacological characterization of 2-aminobenzaldehyde oxime analogs as dual inhibitors of neutrophil elastase and proteinase 3. Bioorg Med Chem23:1123-34 (2015) 
 
Myeloblastin
Name:Myeloblastin
Type:PROTEIN
Mol. Mass.:27816.30
Organism:Homo sapiens (Human)
Description:ChEMBL_1463425
Residue:256
BDBM50084637
NameBDBM50084637
Synonyms:2,2-Dimethyl-propionic acid 4-[2-(carboxymethyl-carbamoyl)-phenylsulfamoyl]-phenyl ester CHEMBL76688 Sivelestat
TypeSmall organic molecule
Emp. Form.C20H22N2O7S
Mol. Mass.434.463
SMILESCC(C)(C)C(=O)Oc1ccc(cc1)S(=O)(=O)Nc1ccccc1C(=O)NCC(O)=O