Reaction Details
TargetMyeloblastin
LigandBDBM50101989
Substrate/Competitorn/a
Meas. Tech.ChEMBL_1463425 (CHEMBL3399762)
IC50 2050±n/a nM
Citation Hwang, TLWang, WHWang, TYYu, HPHsieh, PW Synthesis and pharmacological characterization of 2-aminobenzaldehyde oxime analogs as dual inhibitors of neutrophil elastase and proteinase 3. Bioorg Med Chem23:1123-34 (2015) 
 
Myeloblastin
Name:Myeloblastin
Type:PROTEIN
Mol. Mass.:27816.30
Organism:Homo sapiens (Human)
Description:ChEMBL_1463425
Residue:256
BDBM50101989
NameBDBM50101989
Synonyms:CHEMBL3398154
TypeSmall organic molecule
Emp. Form.C20H21NO5
Mol. Mass.355.3844
SMILESCOC(=O)c1ccccc1NC(=O)c1ccc(OC(=O)C(C)(C)C)cc1