Reaction Details
TargetMyeloblastin
LigandBDBM50101987
Substrate/Competitorn/a
Meas. Tech.ChEMBL_1463425 (CHEMBL3399762)
IC50>10000±n/a nM
Citation Hwang, TLWang, WHWang, TYYu, HPHsieh, PW Synthesis and pharmacological characterization of 2-aminobenzaldehyde oxime analogs as dual inhibitors of neutrophil elastase and proteinase 3. Bioorg Med Chem23:1123-34 (2015) 
 
Myeloblastin
Name:Myeloblastin
Type:PROTEIN
Mol. Mass.:27816.30
Organism:Homo sapiens (Human)
Description:ChEMBL_1463425
Residue:256
BDBM50101987
NameBDBM50101987
Synonyms:CHEMBL3398163
TypeSmall organic molecule
Emp. Form.C17H20N2O4S2
Mol. Mass.380.482
SMILESCC(C)(C)S(=O)Nc1ccc(cc1)S(=O)(=O)Nc1ccccc1C=O