Reaction Details
TargetAmine oxidase [flavin-containing] B
LigandBDBM50063525
Substrate/Competitorn/a
Meas. Tech.ChEMBL_1463344 (CHEMBL3399617)
IC50>100000±n/a nM
Citation Chirkova, ZVKabanova, MVFilimonov, SIAbramov, IGPetzer, APetzer, JPFirgang, SISuponitsky, KY Inhibition of monoamine oxidase by indole-5,6-dicarbonitrile derivatives. Bioorg Med Chem Lett25:1206-11 (2015) 
 
Amine oxidase [flavin-containing] B
Name:Amine oxidase [flavin-containing] B
Type:Protein
Mol. Mass.:58768.76
Organism:Homo sapiens (Human)
Description:P27338
Residue:520
BDBM50063525
NameBDBM50063525
Synonyms:CHEMBL3398528
TypeSmall organic molecule
Emp. Form.C18H12BrN3O2
Mol. Mass.382.211
SMILESCOc1ccc(cc1)-c1c(Br)c2cc(C#N)c(cc2n1OC)C#N