Reaction Details
TargetAmine oxidase [flavin-containing] A
LigandBDBM50063522
Substrate/Competitorn/a
Meas. Tech.ChEMBL_1463352 (CHEMBL3399625)
Ki 18±n/a nM
Citation Chirkova, ZVKabanova, MVFilimonov, SIAbramov, IGPetzer, APetzer, JPFirgang, SISuponitsky, KY Inhibition of monoamine oxidase by indole-5,6-dicarbonitrile derivatives. Bioorg Med Chem Lett25:1206-11 (2015) 
 
Amine oxidase [flavin-containing] A
Name:Amine oxidase [flavin-containing] A
Type:Protein
Mol. Mass.:59689.53
Organism:Homo sapiens (Human)
Description:P21397
Residue:527
BDBM50063522
NameBDBM50063522
Synonyms:CHEMBL3398531
TypeSmall organic molecule
Emp. Form.C17H10ClN3
Mol. Mass.291.734
SMILESCc1ccc(cc1)-c1[nH]c2cc(C#N)c(cc2c1Cl)C#N