Reaction Details
TargetMitogen-activated protein kinase 1
LigandBDBM50063538
Substrate/Competitorn/a
Meas. Tech.ChEMBL_1463477 (CHEMBL3399887)
IC50 5.0±n/a nM
Citation Zhu, HYDesai, JDeng, YCooper, AWang, JShipps, JSamatar, ACarr, DWindsor, W Discovery of hydroxyaniline amides as selective Extracellular Regulated Kinase (Erk) inhibitors. Bioorg Med Chem Lett25:1627-9 (2015) 
 
Mitogen-activated protein kinase 1
Name:Mitogen-activated protein kinase 1
Type:Ser/Thr Protein Kinase
Mol. Mass.:41392.76
Organism:Homo sapiens (Human)
Description:P28482
Residue:360
BDBM50063538
NameBDBM50063538
Synonyms:CHEMBL3398605
TypeSmall organic molecule
Emp. Form.C28H29F3N6O3
Mol. Mass.554.5635
SMILESOc1ccc(NC(=O)[C@@H]2CCN(CC(=O)N3CCN(CC3)c3ccc(cc3)-c3ncccn3)C2)cc1C(F)(F)F