Reaction Details
TargetCoagulation factor VII
LigandBDBM50063581
Substrate/Competitorn/a
Meas. Tech.ChEMBL_1463558 (CHEMBL3398776)
Ki 4220±n/a nM
Citation Pinto, DJSmallheer, JMCorte, JRAustin, EJWang, CFang, TSmith, LMRossi, KARendina, ARBozarth, JMZhang, GWei, ARamamurthy, VSheriff, SMyers, JEMorin, PELuettgen, JMSeiffert, DAQuan, MLWexler, RR Structure-based design of inhibitors of coagulation factor XIa with novel P1 moieties. Bioorg Med Chem Lett25:1635-42 (2015) 
 
Coagulation factor VII
Name:Coagulation factor VII
Type:Enzyme
Mol. Mass.:51599.89
Organism:Homo sapiens (Human)
Description:n/a
Residue:466
BDBM50063581
NameBDBM50063581
Synonyms:CHEMBL3398612
TypeSmall organic molecule
Emp. Form.C26H30ClN7O
Mol. Mass.492.016
SMILESNC[C@H]1CC[C@@H](CC1)C(=O)N[C@@H](Cc1ccccc1)c1nc(c(Cl)[nH]1)-c1ccc2c(N)n[nH]c2c1