Reaction Details
TargetCoagulation factor XI
LigandBDBM50063588
Substrate/Competitorn/a
Meas. Tech.ChEMBL_1463486 (CHEMBL3399896)
Ki 2.2±n/a nM
Citation Pinto, DJSmallheer, JMCorte, JRAustin, EJWang, CFang, TSmith, LMRossi, KARendina, ARBozarth, JMZhang, GWei, ARamamurthy, VSheriff, SMyers, JEMorin, PELuettgen, JMSeiffert, DAQuan, MLWexler, RR Structure-based design of inhibitors of coagulation factor XIa with novel P1 moieties. Bioorg Med Chem Lett25:1635-42 (2015) 
 
Coagulation factor XI
Name:Coagulation factor XI
Type:Enzyme
Mol. Mass.:70130.58
Organism:Homo sapiens (Human)
Description:P03951
Residue:625
BDBM50063588
NameBDBM50063588
Synonyms:CHEMBL3398616
TypeSmall organic molecule
Emp. Form.C28H27ClN8O
Mol. Mass.527.02
SMILESNc1n[nH]c2cc(ccc12)-c1nc([nH]c1Cl)[C@H](Cc1ccccc1)NC(=O)C1CCc2c(N)nccc2C1