Reaction Details
TargetCoagulation factor XI
LigandBDBM50063605
Substrate/Competitorn/a
Meas. Tech.ChEMBL_1463486 (CHEMBL3399896)
Ki 75±n/a nM
Citation Pinto, DJSmallheer, JMCorte, JRAustin, EJWang, CFang, TSmith, LMRossi, KARendina, ARBozarth, JMZhang, GWei, ARamamurthy, VSheriff, SMyers, JEMorin, PELuettgen, JMSeiffert, DAQuan, MLWexler, RR Structure-based design of inhibitors of coagulation factor XIa with novel P1 moieties. Bioorg Med Chem Lett25:1635-42 (2015) 
 
Coagulation factor XI
Name:Coagulation factor XI
Type:Enzyme
Mol. Mass.:70130.58
Organism:Homo sapiens (Human)
Description:P03951
Residue:625
BDBM50063605
NameBDBM50063605
Synonyms:CHEMBL3398632
TypeSmall organic molecule
Emp. Form.C27H25Cl2N7O2
Mol. Mass.550.439
SMILESCOc1ccc(Cl)cc1CNC(=O)N[C@@H](Cc1ccccc1)c1nc(c(Cl)[nH]1)-c1ccc2c(N)n[nH]c2c1