Reaction Details
TargetCoagulation factor XI
LigandBDBM50063610
Substrate/Competitorn/a
Meas. Tech.ChEMBL_1463486 (CHEMBL3399896)
Ki 450±n/a nM
Citation Pinto, DJSmallheer, JMCorte, JRAustin, EJWang, CFang, TSmith, LMRossi, KARendina, ARBozarth, JMZhang, GWei, ARamamurthy, VSheriff, SMyers, JEMorin, PELuettgen, JMSeiffert, DAQuan, MLWexler, RR Structure-based design of inhibitors of coagulation factor XIa with novel P1 moieties. Bioorg Med Chem Lett25:1635-42 (2015) 
 
Coagulation factor XI
Name:Coagulation factor XI
Type:Enzyme
Mol. Mass.:70130.58
Organism:Homo sapiens (Human)
Description:P03951
Residue:625
BDBM50063610
NameBDBM50063610
Synonyms:CHEMBL3398637
TypeSmall organic molecule
Emp. Form.C29H25Cl2N9O
Mol. Mass.586.475
SMILESNc1n[nH]c2cc(ccc12)-c1nc([nH]c1Cl)[C@H](Cc1ccccc1)NC(=O)NCc1cc(Cl)ccc1-n1cccn1