Reaction Details
TargetHistone-lysine N-methyltransferase EZH2
LigandBDBM50063672
Substrate/Competitorn/a
Meas. Tech.ChEMBL_1463615 (CHEMBL3398933)
IC50 24000±n/a nM
Citation Kung, PPHuang, BZehnder, LTatlock, JBingham, PKrivacic, CGajiwala, KDiehl, WYu, XMaegley, KA SAH derived potent and selective EZH2 inhibitors. Bioorg Med Chem Lett25:1532-7 (2015) 
 
Histone-lysine N-methyltransferase EZH2
Name:Histone-lysine N-methyltransferase EZH2
Type:Protein
Mol. Mass.:85367.84
Organism:Homo sapiens (Human)
Description:Q15910
Residue:746
BDBM50063672
NameBDBM50063672
Synonyms:CHEMBL3397315
TypeSmall organic molecule
Emp. Form.C18H29N7O4S
Mol. Mass.439.532
SMILESCCCCNC(=O)C(N)CCSC[C@H]1O[C@H]([C@H](O)[C@@H]1O)n1cnc2c(N)ncnc12