Reaction Details
TargetHistone-lysine N-methyltransferase EHMT1
LigandBDBM50063670
Substrate/Competitorn/a
Meas. Tech.ChEMBL_1463674 (CHEMBL3399061)
IC50>30000±n/a nM
Citation Kung, PPHuang, BZehnder, LTatlock, JBingham, PKrivacic, CGajiwala, KDiehl, WYu, XMaegley, KA SAH derived potent and selective EZH2 inhibitors. Bioorg Med Chem Lett25:1532-7 (2015) 
 
Histone-lysine N-methyltransferase EHMT1
Name:Histone-lysine N-methyltransferase EHMT1
Type:PROTEIN
Mol. Mass.:141443.67
Organism:Homo sapiens (Human)
Description:ChEMBL_1450367
Residue:1298
BDBM50063670
NameBDBM50063670
Synonyms:CHEMBL3397332
TypeSmall organic molecule
Emp. Form.C24H29N9O4S
Mol. Mass.539.61
SMILESN[C@@H](CCSC[C@H]1O[C@H]([C@H](O)[C@@H]1O)n1cnc2c(N)ncnc12)C(=O)NCc1cc([nH]n1)-c1ccccc1