Reaction Details
TargetThyroid hormone receptor alpha
LigandBDBM50063691
Substrate/Competitorn/a
Meas. Tech.ChEMBL_1463693 (CHEMBL3399152)
Ki 7.7±n/a nM
Citation Burkholder, TPCunningham, BEClayton, JRLander, PABrown, MLDoti, RADurst, GLMontrose-Rafizadeh, CKing, COsborne, HEAmos, RMZink, RWStramm, LEBurris, TPCardona, GKonkol, DLReidy, CChriste, MEGenin, MJ Design and synthesis of a novel series of [1-(4-hydroxy-benzyl)-1H-indol-5-yloxy]-acetic acid compounds as potent, selective, thyroid hormone receptorß agonists. Bioorg Med Chem Lett25:1377-80 (2015) 
 
Thyroid hormone receptor alpha
Name:Thyroid hormone receptor alpha
Type:Receptor
Mol. Mass.:54818.00
Organism:Homo sapiens (Human)
Description:Recombinant hThR was obtained from nuclear extracts from SF9 cells infected with baculovirus vectors encoding for ThRalpha 1.
Residue:490
BDBM50063691
NameBDBM50063691
Synonyms:CHEMBL3397335
TypeSmall organic molecule
Emp. Form.C21H23NO4
Mol. Mass.353.4116
SMILESCC(C)c1cc(Cn2cc(C)c3cc(OCC(O)=O)ccc23)ccc1O