Reaction Details
TargetThyroid hormone receptor beta
LigandBDBM50063688
Substrate/Competitorn/a
Meas. Tech.ChEMBL_1463692 (CHEMBL3399151)
Ki 0.140000±n/a nM
Citation Burkholder, TPCunningham, BEClayton, JRLander, PABrown, MLDoti, RADurst, GLMontrose-Rafizadeh, CKing, COsborne, HEAmos, RMZink, RWStramm, LEBurris, TPCardona, GKonkol, DLReidy, CChriste, MEGenin, MJ Design and synthesis of a novel series of [1-(4-hydroxy-benzyl)-1H-indol-5-yloxy]-acetic acid compounds as potent, selective, thyroid hormone receptorß agonists. Bioorg Med Chem Lett25:1377-80 (2015) 
 
Thyroid hormone receptor beta
Name:Thyroid hormone receptor beta
Type:Receptor
Mol. Mass.:52793.62
Organism:Homo sapiens (Human)
Description:Recombinant hThR was obtained from nuclear extracts from SF9 cells infected with baculovirus vectors encoding for ThRbeta 1.
Residue:461
BDBM50063688
NameBDBM50063688
Synonyms:CHEMBL3397338
TypeSmall organic molecule
Emp. Form.C22H25NO4
Mol. Mass.367.4382
SMILESCC(C)c1cc(Cn2c(C)cc3cc(OCC(O)=O)cc(C)c23)ccc1O