Reaction Details
TargetFibroblast growth factor 2
LigandBDBM50063844
Substrate/Competitorn/a
Meas. Tech.ChEMBL_1462508 (CHEMBL3398981)
Kd 41±n/a nM
Citation Wakao, MObata, RMiyachi, KKaitsubata, YKondo, TSakami, CSuda, Y Synthesis of a chondroitin sulfate disaccharide library and a GAG-binding protein interaction analysis. Bioorg Med Chem Lett25:1407-11 (2015) 
 
Fibroblast growth factor 2
Name:Fibroblast growth factor 2
Type:Protein
Mol. Mass.:30803.89
Organism:Homo sapiens (Human)
Description:P09038
Residue:288
BDBM50063844
NameBDBM50063844
Synonyms:CHEMBL3397490
TypeSmall organic molecule
Emp. Form.C34H50N3Na3O23S4
Mol. Mass.1065.996
SMILES[Na+].[Na+].[Na+].[H][C@@]1(O[C@@H]2[C@@H](NC(C)=O)[C@@H](OC[C@@H](O)[C@@H](O)[C@H](O)[C@@H](O)CNc3cccc(NC(=O)CCCCC4CCSS4)c3)O[C@H](CO)[C@@H]2OS([O-])(=O)=O)O[C@@H]([C@@H](O)[C@H](OS([O-])(=O)=O)[C@H]1O)C([O-])=O