Reaction Details
TargetFatty acid-binding protein, heart
LigandBDBM50063854
Substrate/Competitorn/a
Meas. Tech.ChEMBL_1463784 (CHEMBL3404794)
IC50 5160±n/a nM
Citation Cai, HLiu, QGao, DWang, TChen, TYan, GChen, KXu, YWang, HLi, YZhu, W Novel fatty acid binding protein 4 (FABP4) inhibitors: virtual screening, synthesis and crystal structure determination. Eur J Med Chem90:241-50 (2015) 
 
Fatty acid-binding protein, heart
Name:Fatty acid-binding protein, heart
Type:PROTEIN
Mol. Mass.:14858.36
Organism:Homo sapiens (Human)
Description:ChEMBL_1463784
Residue:133
BDBM50063854
NameBDBM50063854
Synonyms:CHEMBL3400157
TypeSmall organic molecule
Emp. Form.C15H24O3S
Mol. Mass.284.414
SMILESCC(C)c1cc(C(C)C)c(c(c1)C(C)C)S(O)(=O)=O