Reaction Details
TargetSphingosine 1-phosphate receptor 1
LigandBDBM50063871
Substrate/Competitorn/a
Meas. Tech.ChEMBL_1463789 (CHEMBL3404799)
EC50 290±n/a nM
Citation Buzard, DJSchrader, TOZhu, XLehmann, JJohnson, BKasem, MKim, SHKawasaki, ALopez, LMoody, JHan, SGao, YEdwards, JBarden, JThatte, JGatlin, JJones, RM Design and synthesis of new tricyclic indoles as potent modulators of the S1P1 receptor. Bioorg Med Chem Lett25:659-63 (2015) 
 
Sphingosine 1-phosphate receptor 1
Name:Sphingosine 1-phosphate receptor 1
Type:Enzyme
Mol. Mass.:42836.02
Organism:Homo sapiens (Human)
Description:P21453
Residue:382
BDBM50063871
NameBDBM50063871
Synonyms:CHEMBL3400914
TypeSmall organic molecule
Emp. Form.C21H19F3N2O4
Mol. Mass.420.3818
SMILESOC(=O)CC1NCCc2c1[nH]c1ccc(OCc3cccc(OC(F)(F)F)c3)cc21