Reaction Details
TargetSphingosine 1-phosphate receptor 1
LigandBDBM50063873
Substrate/Competitorn/a
Meas. Tech.ChEMBL_1463789 (CHEMBL3404799)
EC50 10000±n/a nM
Citation Buzard, DJSchrader, TOZhu, XLehmann, JJohnson, BKasem, MKim, SHKawasaki, ALopez, LMoody, JHan, SGao, YEdwards, JBarden, JThatte, JGatlin, JJones, RM Design and synthesis of new tricyclic indoles as potent modulators of the S1P1 receptor. Bioorg Med Chem Lett25:659-63 (2015) 
 
Sphingosine 1-phosphate receptor 1
Name:Sphingosine 1-phosphate receptor 1
Type:Enzyme
Mol. Mass.:42836.02
Organism:Homo sapiens (Human)
Description:P21453
Residue:382
BDBM50063873
NameBDBM50063873
Synonyms:CHEMBL3400912
TypeSmall organic molecule
Emp. Form.C21H22N2O5S
Mol. Mass.414.475
SMILESCS(=O)(=O)c1ccc(COc2ccc3[nH]c4C(CC(O)=O)NCCc4c3c2)cc1