Reaction Details
TargetSphingosine 1-phosphate receptor 1
LigandBDBM50063893
Substrate/Competitorn/a
Meas. Tech.ChEMBL_1463789 (CHEMBL3404799)
EC50 0.480000±n/a nM
Citation Buzard, DJSchrader, TOZhu, XLehmann, JJohnson, BKasem, MKim, SHKawasaki, ALopez, LMoody, JHan, SGao, YEdwards, JBarden, JThatte, JGatlin, JJones, RM Design and synthesis of new tricyclic indoles as potent modulators of the S1P1 receptor. Bioorg Med Chem Lett25:659-63 (2015) 
 
Sphingosine 1-phosphate receptor 1
Name:Sphingosine 1-phosphate receptor 1
Type:Enzyme
Mol. Mass.:42836.02
Organism:Homo sapiens (Human)
Description:P21453
Residue:382
BDBM50063893
NameBDBM50063893
Synonyms:CHEMBL3403629
TypeSmall organic molecule
Emp. Form.C23H22ClF2NO5
Mol. Mass.465.874
SMILESOC(=O)CC1OCCn2c1cc1cc(OCc3ccc(OC(CF)CF)c(Cl)c3)ccc21