Reaction Details
TargetSphingosine 1-phosphate receptor 1
LigandBDBM50063895
Substrate/Competitorn/a
Meas. Tech.ChEMBL_1463789 (CHEMBL3404799)
EC50 0.040000±n/a nM
Citation Buzard, DJSchrader, TOZhu, XLehmann, JJohnson, BKasem, MKim, SHKawasaki, ALopez, LMoody, JHan, SGao, YEdwards, JBarden, JThatte, JGatlin, JJones, RM Design and synthesis of new tricyclic indoles as potent modulators of the S1P1 receptor. Bioorg Med Chem Lett25:659-63 (2015) 
 
Sphingosine 1-phosphate receptor 1
Name:Sphingosine 1-phosphate receptor 1
Type:Enzyme
Mol. Mass.:42836.02
Organism:Homo sapiens (Human)
Description:P21453
Residue:382
BDBM50063895
NameBDBM50063895
Synonyms:CHEMBL3403631
TypeSmall organic molecule
Emp. Form.C24H23ClN2O5
Mol. Mass.454.903
SMILESCC(C)Oc1ccc(COc2ccc3n4CCOC(CC(O)=O)c4c(Cl)c3c2)cc1C#N