Reaction Details
TargetCannabinoid receptor 2
LigandBDBM50063902
Substrate/Competitorn/a
Meas. Tech.ChEMBL_1464106 (CHEMBL3406632)
EC50 1.4±n/a nM
Citation Hickey, ERZindell, RCirillo, PFWu, LErmann, MBerry, AKThomson, DSAlbrecht, CGemkow, MJRiether, D Selective CB2 receptor agonists. Part 1: the identification of novel ligands through computer-aided drug design (CADD) approaches. Bioorg Med Chem Lett25:575-80 (2015) 
 
Cannabinoid receptor 2
Name:Cannabinoid receptor 2
Type:G Protein-Coupled Receptor (GPCR)
Mol. Mass.:39690.94
Organism:Homo sapiens (Human)
Description:P34972
Residue:360
BDBM50063902
NameBDBM50063902
Synonyms:CHEMBL3400938
TypeSmall organic molecule
Emp. Form.C18H16F6N4O3
Mol. Mass.450.3351
SMILESFC(F)(F)c1cc(NC(=O)N2CCCN(CC2)C(=O)c2ccc(cc2)C(F)(F)F)no1